• Minor technical glitch has been resolved. Logging in and posting is now possible again!
  • Congratulations to new Staff Members on their promotion!

Compiling OTC error

jackl90

Member
Joined
Jul 25, 2017
Messages
176
Best answers
0
Reaction score
6
Code:
1>c:\users\server\desktop\otclient-master\src\framework\sound\declarations.h(30): fatal error C1083: Cannot open include file: 'AL/al.h': No such file or directory (compiling source file ..\src\framework\core\graphicalapplication.cpp)
1>module.cpp
1>Unknown compiler version - please run the configure tests and report the results
1>modulemanager.cpp
1>Unknown compiler version - please run the configure tests and report the results
1>resourcemanager.cpp
1>Unknown compiler version - please run the configure tests and report the results
1>scheduledevent.cpp
1>Unknown compiler version - please run the configure tests and report the results
1>timer.cpp
1>Unknown compiler version - please run the configure tests and report the results
1>Done building project "otclient.vcxproj" -- FAILED.
========== Build: 0 succeeded, 1 failed, 0 up-to-date, 0 skipped ==========
Using visual studio 2017, release win32
 

Apollos

Dude who does stuff
Joined
Apr 22, 2009
Messages
744
Best answers
110
Reaction score
482
Location
United States
Code:
1>c:\users\server\desktop\otclient-master\src\framework\sound\declarations.h(30): fatal error C1083: Cannot open include file: 'AL/al.h': No such file or directory (compiling source file ..\src\framework\core\graphicalapplication.cpp)
1>module.cpp
1>Unknown compiler version - please run the configure tests and report the results
1>modulemanager.cpp
1>Unknown compiler version - please run the configure tests and report the results
1>resourcemanager.cpp
1>Unknown compiler version - please run the configure tests and report the results
1>scheduledevent.cpp
1>Unknown compiler version - please run the configure tests and report the results
1>timer.cpp
1>Unknown compiler version - please run the configure tests and report the results
1>Done building project "otclient.vcxproj" -- FAILED.
========== Build: 0 succeeded, 1 failed, 0 up-to-date, 0 skipped ==========
Using visual studio 2017, release win32
Change these lines:
To this:
C++:
#include <al.h>
#include <alc.h>
 
Top